Humord
type: ConceptScheme

Karakoram
type: Geografisk
type: Concept
ccmapper candidates: 10
ccmapper state: accepted
created: 2017-02-23T00:00:00
modified: 2025-02-24T14:48:53
alternative label: Karakorum (Fjellkjede)
broad match: e23
broader: (Asia i områder/regioner)
definition: Karakorum er verdens nest høyeste fjellkjede. Karakorumfjellene ligger i Kashmir og danner en fortsettelse av Himalaya mot nordvest. <SNL>
in scheme: Humord
mapping relation: e23

(Asia i områder/regioner)
type: ThesaurusArray
type: Collection
narrower: Karakoram
preferred label: (Asia i område/regionar) @nn
preferred label: (Asia by areas/regions) @en

Geografisk
type: Class
label: Geographic @en