Humord
type: ConceptScheme

(historie etter opprør)
type: ThesaurusArray
type: Collection
narrower: Intifada
preferred label: (history by revolts) @en

Intifada
type: Concept
type: Innholdsbeskrivende emne
ccmapper candidates: 7
ccmapper state: accepted
created: 2015-11-19T00:00:00
modified: 2024-08-14T14:27:57
alternative label: First intifada @en
alternative label: Second intifada @en
alternative label: Intifadaer
alternative label: Andre intifada
alternative label: Intifadaar
alternative label: Første intifada
broad match: e23
broader: (historie etter opprør)
definition: Intifada er et navn som først ble brukt på det folkelige palestinske opprøret mot israelske militære i de israelsk-okkuperte områdene på Vestbredden og Gaza i 1987–1993 (den første intifada). <SNL> @nb
in scheme: Humord
mapping relation: e23

Innholdsbeskrivende emne
type: Class
label: Topic @en