Humord
type: ConceptScheme

(historie etter opprør)
type: ThesaurusArray
type: Collection
narrower: Lange marsjen
preferred label: (history by revolts) @en

Lange marsjen
type: Concept
type: Innholdsbeskrivende emne
ccmapper candidates: 1
ccmapper state: accepted
created: 1994-03-21T00:00:00
modified: 2025-09-18T09:45:17
broad match: e23
broader: (historie etter opprør)
definition: Den lange marsjen var den omfattende militære retrett under den kinesiske borgerkrig som den røde arme foretok ut av provinsen Jiangxi for å unnslippe Kuomintangs overlegne styrker. <wikipedia>
in scheme: Humord
mapping relation: e23
preferred label: Long March @en

Innholdsbeskrivende emne
type: Class
label: Topic @en