Humord
type: ConceptScheme

(historie etter konflikter)
type: ThesaurusArray
type: Collection
narrower: Cubakrisen
preferred label: (historie etter konfliktar) @nn
preferred label: (history by conflicts) @en

Cubakrisen
type: Concept
type: Innholdsbeskrivende emne
ccmapper candidates: 15
ccmapper state: accepted
created: 1994-03-21T00:00:00
modified: 2024-12-11T11:22:42
alternative label: Caribbean Crisis @en
alternative label: Cuba-krisa @nn
alternative label: Cuba-krisen
broad match: e23
broader: (historie etter konflikter)
definition: Cubakrisen var konfrontasjonen som oppstod mellom USA og Sovjetunionen i oktober 1962 på grunn av opptrappingen av det sovjetiske militære engasjement på Cuba. Krisen brakte de to supermaktene til randen av atomkrig. <SNL>
in scheme: Humord
mapping relation: e23
preferred label: Cuban Missile Crisis @en
preferred label: Cubakrisa @nn
related match: e23

Innholdsbeskrivende emne
type: Class
label: Topic @en