Humord
type: ConceptScheme

(historie etter konflikter)
type: ThesaurusArray
type: Collection
narrower: Investiturstriden
preferred label: (historie etter konfliktar) @nn
preferred label: (history by conflicts) @en

Investiturstriden
type: Concept
type: Innholdsbeskrivende emne
ccmapper candidates: 8
ccmapper state: accepted
created: 1994-03-21T00:00:00
modified: 2024-12-11T11:23:53
alternative label: Investiture contest @en
broad match: e23
broader: (historie etter konflikter)
definition: Investiturstriden var navnet på en kamp mellom pavemakten og den tysk-romerske keiseren om retten til å utnevne biskoper i høymiddelalderen. <SNL>
in scheme: Humord
mapping relation: e23
preferred label: Investiture controversy @en

Innholdsbeskrivende emne
type: Class
label: Topic @en