Humord
type: ConceptScheme

(historie etter konflikter)
type: ThesaurusArray
type: Collection
narrower: Åland Islands dispute
preferred label: (historie etter konfliktar) @nn
preferred label: (history by conflicts) @en

Åland Islands dispute
type: Concept
type: Innholdsbeskrivende emne
ccmapper candidates: 11
ccmapper state: accepted
created: 1994-03-21T00:00:00
modified: 2024-08-19T12:56:19
broad match: e23
broader: (historie etter konflikter)
definition: Ålandsspørsmålet refererer til en internasjonal konflikt på begynnelsen av 1920-tallet om den politiske statusen til Åland. <uio>
in scheme: Humord
mapping relation: e23
preferred label: Ålandsspørsmålet

Innholdsbeskrivende emne
type: Class
label: Topic @en