Humord
type: ConceptScheme

(kunst etter retning, stil, synsvinkel)
type: ThesaurusArray
type: Collection
narrower: Art deco
preferred label: (art by direction, style, angle) @en

Art deco
type: Concept
type: Innholdsbeskrivende emne
ccmapper candidates: 11
ccmapper state: accepted
created: 1994-03-21T00:00:00
modified: 2025-04-04T13:49:56
alternative label: Arts decoratifs
broader: (kunst etter retning, stil, synsvinkel)
definition: Art deco: stil innanfor arkitektur, design eller liknande i 1920- og 30-åra som er prega av dekorative framfor funksjonelle omsyn <ordbøkene.no>
in scheme: Humord
mapping relation: e23
related match: e23

Innholdsbeskrivende emne
type: Class
label: Topic @en