Humord
type: ConceptScheme

(kunst etter retning, stil, synsvinkel)
type: ThesaurusArray
type: Collection
narrower: Arte Povera
preferred label: (art by direction, style, angle) @en

Arte Povera
type: Innholdsbeskrivende emne
type: Concept
ccmapper candidates: 18
ccmapper state: accepted
created: 1994-03-21T00:00:00
modified: 2025-04-11T15:21:24
broad match: e23
broader: (kunst etter retning, stil, synsvinkel)
definition: Arte povera betyr direkte oversatt «fattig kunst» og er en kunstbevegelse som utviklet seg i Italia mot slutten av 1960-årene. Denne retningen, gjerne regnet for en type avantgarde-kunst, oppsto som en reaksjon mot samtidens teknologiske og materielle utvikling samt de etablerte statlige institusjonene <SNL>
in scheme: Humord
mapping relation: e23
preferred label: Arte povera
related match: e23

Innholdsbeskrivende emne
type: Class
label: Topic @en