Humord
type: ConceptScheme

(kunst etter retning, stil, synsvinkel)
type: ThesaurusArray
type: Collection
narrower: Eksotisme
preferred label: (art by direction, style, angle) @en

Eksotisme
type: Innholdsbeskrivende emne
type: Concept
ccmapper candidates: 9
ccmapper state: accepted
created: 1994-03-21T00:00:00
modified: 2025-04-11T13:47:54
alternative label: Exotism @en
broader: (kunst etter retning, stil, synsvinkel)
definition: Eksotisme er en kunstretning som er inspirert av kunst fra fjerne kulturer, særlig tropiske <ordbøkene.no>
in scheme: Humord
mapping relation: e23
preferred label: Exoticism @en
related match: e23

Innholdsbeskrivende emne
type: Class
label: Topic @en