Humord
type: ConceptScheme

(kunst etter retning, stil, synsvinkel)
type: ThesaurusArray
type: Collection
narrower: Mannerism
preferred label: (art by direction, style, angle) @en

Mannerism
type: Concept
type: Innholdsbeskrivende emne
ccmapper candidates: 9
ccmapper state: accepted
created: 1994-11-07T00:00:00
modified: 2025-05-30T12:29:45
alternative label: Manierisme
broad match: e23
broader: (kunst etter retning, stil, synsvinkel)
definition: Manierisme er perioden innen italiensk kunst som fulgte etter høyrenessansen og vokste fram rundt 1515–1520. Denne kunstretningen markerer en overgangstid mellom renessansens harmoniske idealer og barokkens dramatiske uttrykk <SNL>
in scheme: Humord
mapping relation: e23
preferred label: Manierismen

Innholdsbeskrivende emne
type: Class
label: Topic @en