Humord
type: ConceptScheme

(art by direction, style, angle)
type: ThesaurusArray
type: Collection
narrower: Minimalism
preferred label: (kunst etter retning, stil, synsvinkel) @nn

Minimalism
type: Concept
type: Topic
ccmapper candidates: 15
ccmapper state: accepted
created: 1994-03-21T00:00:00
modified: 2025-05-30T11:38:07
alternative label: Minimal art
alternative label: Minimalisme @nn
broader: (art by direction, style, angle)
definition: Minimalisme er ei nemning på ulike rørsler, uttrykksformer og stiltrekk innanfor kunst, arkitektur og design. Minimalistisk kunst og design er kjenneteikna ved ei redusering av form og verkemidlar, ned til det mest fundamentale formale og innhaldsmessige utgangspunkt. Som kunstnerisk rørsle vert minimalismen rekna å ha oppstått i USA på byrjinga av 1960-talet, mellom anna som ei reaksjon mot den dominerande abstrakte ekspresjonismen. <wikipedia> @nb
in scheme: Humord
mapping relation: e23
preferred label: Minimalismen @nn

Topic
type: Class
label: Innholdsbeskrivende emne @nb