Humord
type: ConceptScheme

(verb by type)
type: ThesaurusArray
type: Collection
narrower: Denominal verbs
preferred label: (verb etter type) @nn

Denominal verbs
type: Topic
type: Concept
ccmapper candidates: 10
ccmapper state: accepted
created: 2009-10-22T00:00:00
modified: 2025-07-22T14:42:54
alternative label: Denominative verbs
broad match: e23
broader: (verb by type)
definition: Denominativ er i språkvitskapen eit verb som er laga av eit nomen – det vil seie eit substantiv eller adjektiv – som verbet dømme av substantivet dom og verbet surne av adjektivet sur. <SNL> @nb
in scheme: Humord
mapping relation: e23
preferred label: Denominale verb @nn

Topic
type: Class
label: Innholdsbeskrivende emne @nb