Humord
type: ConceptScheme

(personer etter sosiale, økonomiske og fysiske særtrekk eller egenskaper)
type: ThesaurusArray
type: Collection
narrower: Junkere
preferred label: (personar etter sosiale, økonomiske og fysiske særtrekk eller eigenskapar) @nn
preferred label: (persons by social, economical or physical features or characteristics) @en

Junkere
type: Innholdsbeskrivende emne
type: Concept
ccmapper candidates: 10
ccmapper state: accepted
created: 2009-10-22T00:00:00
modified: 2024-11-05T19:41:32
broad match: e23
broader: (personer etter sosiale, økonomiske og fysiske særtrekk eller egenskaper)
definition: Junker er opprinnelig en tittel for en kongesønn, senere for en ung adelsmann som ennå ikke var slått til ridder, videre for en ung adelsmann som tjente ved et hoff eller var gått inn i hæren for å bli offiser <SNL>
in scheme: Humord
mapping relation: e23
preferred label: Junkers @en
preferred label: Junkarar @nn

Innholdsbeskrivende emne
type: Class
label: Topic @en