Humord
type: ConceptScheme

(characters by type)
type: ThesaurusArray
type: Collection
narrower: Wandering Jew
preferred label: (skikkelsar etter type) @nn
preferred label: (skikkelser etter type) @nb

Wandering Jew
type: Topic
type: Concept
ccmapper candidates: 1
ccmapper state: accepted
created: 1994-03-21T00:00:00
modified: 2024-07-26T14:51:49
alternative label: Jerusalems skomaker @nb
alternative label: Evige jøde @nn
alternative label: Paul Marrane
alternative label: Buttadeus
alternative label: Isaac Laquedem
alternative label: Jerusalems skomakar @nb
alternative label: Evige skomaker @nb
alternative label: Vandrende jøde @nb
alternative label: Shoemaker of Jerusalem
alternative label: Vandrande jøde @nb
alternative label: Ahasver
alternative label: Evige skomakar @nn
alternative label: Eternal Jew
alternative label: Matathias
broad match: e23
broader: (characters by type)
definition: Ahasverus, den evig vandrende jøde, er opprinnelig en myteomspunnet skikkelse fra kristen sagntradisjon som kan spores helt tilbake til 1200-tallets Tyskland. Det dreier seg om en figur som skal ha spottet Jesus eller plaget Jesus på hans tunge vei mot Golgata. Som straff for dette skal personen være dømt til å vandre hvileløst i verden, helt til Jesu gjenkomst. <SNL> @nb
in scheme: Humord
mapping relation: e23
preferred label: Ahasverus @nn

Topic
type: Class
label: Innholdsbeskrivende emne @nb