Humord
type: ConceptScheme

(history by regimes)
type: ThesaurusArray
type: Collection
narrower: Second Spanish Republic
preferred label: (historie etter regime) @nn
preferred label: (historie etter regimer) @nb

Second Spanish Republic
type: Concept
type: Topic
ccmapper candidates: 1
ccmapper state: accepted
created: 2005-01-11T00:00:00
modified: 2024-08-14T14:34:43
alternative label: Spanish Republic
alternative label: The Spanish Republic
alternative label: Den andre republikk (Spania) @nn
alternative label: Andre spanske republikk @nn
alternative label: The Second Spanish Republic
alternative label: Den andre spanske republikk @nn
broader: (history by regimes)
definition: Den andre spanske republikken er navnet på statsdannelsen som eksisterte i Spania fra 14. april 1931, da kong Alfonso XIII forlot landet, til 1. april 1939, da de siste republikanske styrkene overga seg til de nasjonalistiske styrkene under den spanske borgerkrigen. <wikipedia @nb
in scheme: Humord
mapping relation: e23
preferred label: Andre republikk (Spania) @nn

Topic
type: Class
label: Innholdsbeskrivende emne @nb