Humord
type: ConceptScheme

(tid inndelt i enheter)
type: ThesaurusArray
type: Collection
narrower: Thermidor
preferred label: (tid inndelt i einingar) @nn
preferred label: (time divided in units) @en

Thermidor
type: Concept
type: Innholdsbeskrivende emne
ccmapper candidates: 6
ccmapper state: accepted
created: 1994-03-21T00:00:00
modified: 2025-04-08T08:19:04
broader: (tid inndelt i enheter)
definition: Den 11. måned i den franske revolusjonskalender, fra 19. juli til 18. august, "varmemåneden" <FO>
in scheme: Humord
mapping relation: e23
related match: e23

Innholdsbeskrivende emne
type: Class
label: Topic @en