Humord
type: ConceptScheme

(kunst etter retning, stil, synsvinkel)
type: ThesaurusArray
type: Collection
narrower: Nysaklighet
preferred label: (art by direction, style, angle) @en

Nysaklighet
type: Innholdsbeskrivende emne
type: Concept
ccmapper candidates: 24
ccmapper state: accepted
created: 1995-07-04T00:00:00
modified: 2025-04-11T11:14:34
alternative label: Neue Sachlichkeit
broad match: e23
broader: (kunst etter retning, stil, synsvinkel)
definition: Nysaklighet er en retning innen tysk kunst og litteratur i perioden ca 1925-1933. Det var en reaksjon mot ekspresjonismen og ville føre malerkunsten tilbake til virkeligheten gjennom en skarp iakttagelse av objektet, tydelig tegnemåte og en særdeles fast komposisjon. <SNL>
in scheme: Humord
mapping relation: e23
preferred label: Nysaklegheit @nn
preferred label: New objectivity @en

Innholdsbeskrivende emne
type: Class
label: Topic @en