Humord
type: ConceptScheme

(lyrikk etter type)
type: ThesaurusArray
type: Collection
narrower: Canzone
preferred label: (poetry by type) @en

Canzone
type: Concept
type: Innholdsbeskrivende emne
ccmapper candidates: 1
ccmapper state: accepted
created: 1997-02-14T00:00:00
modified: 2024-09-04T16:09:56
broad match: e23
broader: (lyrikk etter type)
definition: Lyrisk kunstform, opprinnelig i italiensk dikting, utviklet fra den provencalske canso <SNL>
in scheme: Humord
mapping relation: e23
preferred label: Canzone (Lyrikk)

Innholdsbeskrivende emne
type: Class
label: Topic @en