Humord
type: ConceptScheme

(verb etter type)
type: ThesaurusArray
type: Collection
narrower: Iterative verbs
preferred label: (verb by type) @en

Iterative verbs
type: Innholdsbeskrivende emne
type: Concept
ccmapper candidates: 10
ccmapper state: accepted
created: 2009-10-22T00:00:00
modified: 2025-07-22T14:53:17
broad match: e23
broader: (verb etter type)
definition: Et verb er iterativt dersom det nødvendigvis uttrykker at en handling stadig blir gjentatt eller repetert. Eksempler på iterative verb er for eksempel klapre og klappe, men også verbfraser kan være iterative, slik som å hakke tenner. Iterative verb er en undergruppe av durative verb. <SNL>
in scheme: Humord
mapping relation: e23
preferred label: Iterative verb

Innholdsbeskrivende emne
type: Class
label: Topic @en