Humord
type: ConceptScheme

Meiji Restoration
type: Concept
type: Innholdsbeskrivende emne
ccmapper candidates: 10
ccmapper state: accepted
created: 2019-03-13T00:00:00
modified: 2024-12-16T11:03:45
alternative label: Meiji restoration
alternative label: Meiji revolution @en
alternative label: Meiji ishin
broad match: e23
broader: (historie etter politiske hendelser)
definition: Reformperiode i Japan i siste halvdel av 1800-tallet. Brukes om revolusjonen 1868-1869 da Tokugawa-shogunatet falt og keiseren fikk sin makt tilbake <Store danske encykl.>
in scheme: Humord
mapping relation: e23
preferred label: Meijirestaurasjonen

(historie etter politiske hendelser)
type: ThesaurusArray
type: Collection
narrower: Meiji Restoration
preferred label: (historie etter politiske hendingar @nn
preferred label: (history by political events) @en

Innholdsbeskrivende emne
type: Class
label: Topic @en