Humord
type: ConceptScheme

(kunst etter retning, stil, synsvinkel)
type: ThesaurusArray
type: Collection
narrower: Ukiyo-e
preferred label: (art by direction, style, angle) @en

Ukiyo-e
type: Concept
type: Innholdsbeskrivende emne
ccmapper candidates: 6
ccmapper state: accepted
created: 2007-08-22T00:00:00
modified: 2025-04-11T11:34:58
alternative label: Ukiyoe
broad match: e23
broader: (kunst etter retning, stil, synsvinkel)
definition: Ukiyo-e er en av de viktigste retningene innen japansk billedkunst i tokugawaperioden,1603-1867 <Britannica>
in scheme: Humord
mapping relation: e23

Innholdsbeskrivende emne
type: Class
label: Topic @en