Humord
type: ConceptScheme

(politikk etter type)
type: ThesaurusArray
type: Collection
narrower: Biopolitikk
preferred label: (politics by type) @en

Biopolitikk
type: Concept
type: Innholdsbeskrivende emne
ccmapper candidates: 10
ccmapper state: accepted
created: 2015-02-05T00:00:00
modified: 2024-07-01T12:23:27
broader: (politikk etter type)
definition: Reguleringsprosesser som gjøres gjennom politikk og lovverk, og noe som foregår gjennom individers eller gruppers egen selvforståelse og innordning; beskjeftiger seg med innbyggerens helse, vaksinasjonsprogrammer o.l. <UBO>
editorial note: Lukket bemerkning: ubo11
in scheme: Humord
mapping relation: e23
mapping relation: c009391
preferred label: Biopolitics @en
related match: e23

Innholdsbeskrivende emne
type: Class
label: Topic @en