Humord
type: ConceptScheme

(økonomi etter type)
type: ThesaurusArray
type: Collection
narrower: Velferdsøkonomi
preferred label: (economy by type) @en

Velferdsøkonomi
type: Concept
type: Innholdsbeskrivende emne
ccmapper candidates: 11
ccmapper state: accepted
created: 2011-06-07T00:00:00
modified: 2025-05-08T08:52:18
broad match: e23
broader: (økonomi etter type)
definition: Velferdsøkonomi er en gren av sosialøkonomien som særlig behandler valg av økonomisk politikk <SNL>
editorial note: Lukket bemerkning: ubo11
in scheme: Humord
mapping relation: e23
preferred label: Welfare economy @en

Innholdsbeskrivende emne
type: Class
label: Topic @en