Humord
type: ConceptScheme

(økonomi etter type)
type: ThesaurusArray
type: Collection
narrower: Evolutionary economics
preferred label: (economy by type) @en

Evolutionary economics
type: Concept
type: Innholdsbeskrivende emne
ccmapper candidates: 1
ccmapper state: accepted
created: 2011-12-15T00:00:00
modified: 2025-05-08T08:29:54
broad match: e23
broader: (økonomi etter type)
definition: Søker å forklare økonomisk atferd og framdrift i forhold til evolusjon og evolusjonære menneskelige instinkter som predasjon, emulering og nysgjerrighet <UBO>
editorial note: Lukket bemerkning: ubo11
in scheme: Humord
mapping relation: e23
preferred label: Evolusjonær økonomi

Innholdsbeskrivende emne
type: Class
label: Topic @en