Humord
type: ConceptScheme

(historie etter kriger)
type: ThesaurusArray
type: Collection
narrower: Hugenottkrigene
preferred label: (historie etter krigar) @nn
preferred label: (history by wars) @en

Hugenottkrigene
type: Concept
type: Innholdsbeskrivende emne
ccmapper candidates: 19
ccmapper state: accepted
created: 2019-03-11T00:00:00
modified: 2024-10-11T09:39:20
alternative label: De franske religionskrigene
alternative label: Wars of Religion, France, 1562-1598 @en
alternative label: Dei franske religionskrigane @nn
broad match: e23
broader: (historie etter kriger)
definition: Hugenottkrigene (1562-1598) betegner perioden med sivil uro og militæroperasjoner, hovedsakelig utkjempet mellom de franske katolikkene og de protestantiske hugenottene. <Wikipedia>
editorial note: Lukket bemerkning: ubo19
in scheme: Humord
mapping relation: e23
preferred label: Hugenottkrigane @nn
preferred label: Wars of the Huguenots, 1562-1598 @en

Innholdsbeskrivende emne
type: Class
label: Topic @en