Humord
type: ConceptScheme

(krig etter type)
type: ThesaurusArray
type: Collection
narrower: Stedfortrederkrig
preferred label: (war by type) @en

Stedfortrederkrig
type: Concept
type: Innholdsbeskrivende emne
ccmapper candidates: 1
ccmapper state: accepted
created: 2019-06-04T00:00:00
modified: 2025-10-13T08:53:11
alternative label: War by proxy @en
broad match: e23
broader: (krig etter type)
definition: Krig som offisielt utkjempes av to parter, hvor hver av disse partene er alliert med (eller støttet av) andre, større makter. Det egentlige målet med krigen er å flytte maktbalansen mellom stormaktene <NNI>
editorial note: Lukket bemerkning: nni19
in scheme: Humord
mapping relation: e23
preferred label: Proxy war @en
preferred label: Stadfortredarkrig @nn
related match: e23

Innholdsbeskrivende emne
type: Class
label: Topic @en