Humord
type: ConceptScheme

(historie etter opprør)
type: ThesaurusArray
type: Collection
narrower: Maidan-opprøret
preferred label: (history by revolts) @en

Maidan-opprøret
type: Concept
type: Innholdsbeskrivende emne
ccmapper candidates: 1
ccmapper state: accepted
created: 2020-05-26T00:00:00
modified: 2024-10-01T07:54:20
alternative label: Majdan-revolusjonen
alternative label: Verdigheitsrevolusjonen
alternative label: Ukrainian revolution of 2014 @en
alternative label: Revolution of dignity @en
alternative label: Maidan-revolusjonen
alternative label: Euromaidan revolution @en
preferred label: Euromaidan
alternative label: Verdighetsrevolusjonen @nb
alternative label: Euromajdan
broad match: e23
broader: (historie etter opprør)
definition: Euromajdan også kalt verdighetsrevolusjonen og maidan-opprøret,var et folkelig opprør i Ukraina som foregikk fra november 2013 til februar 2014. <wikipedia> @nb
editorial note: Lukket bemerkning: ubo20 @nb
in scheme: Humord
mapping relation: e23

Innholdsbeskrivende emne
type: Class
label: Topic @en