Humord
type: ConceptScheme

(kunst etter retning, stil, synsvinkel)
type: ThesaurusArray
type: Collection
narrower: Black arts movement
preferred label: (art by direction, style, angle) @en

Black arts movement
type: Concept
type: Innholdsbeskrivende emne
created: 2022-01-25T00:00:00
modified: 2025-04-25T10:14:57
broader: (kunst etter retning, stil, synsvinkel)
definition: The Black Arts Movement var en afroamerikansk-ledet kunstbevegelse som var aktiv på 1960- og 1970-tallet. Gjennom aktivisme og kunst skapte BAM nye kulturinstitusjoner og formidlet et budskap om svart stolthet <wikipedia>
editorial note: Lukket bemerkning: Nasjonalmuseet22
in scheme: Humord
preferred label: Black Arts movement @en

Innholdsbeskrivende emne
type: Class
label: Topic @en