Humord
type: ConceptScheme

(sosiologi etter type)
type: ThesaurusArray
type: Collection
narrower: Ethnomethodology
preferred label: (sociology by type) @en

Ethnomethodology
type: Innholdsbeskrivende emne
type: Concept
ccmapper candidates: 1
ccmapper state: accepted
created: 2022-11-02T00:00:00
modified: 2025-09-18T08:54:56
broad match: e23
broader: (sosiologi etter type)
definition: Etnometodologi er en betegnelse for et program innenfor sosiologien for å studere folks hverdagslige atferd ut fra deres egne praksiser, begreper og forestillinger, heller enn å fortolke atferden ut fra fagbestemte teoretiske modeller <SNL>
editorial note: Lukket bemerkning: ubo22
in scheme: Humord
mapping relation: e23
preferred label: Etnometodologi

Innholdsbeskrivende emne
type: Class
label: Topic @en