Humord
type: ConceptScheme

(personer etter sosiale, økonomiske og fysiske særtrekk eller egenskaper)
type: ThesaurusArray
type: Collection
narrower: Lekfolk
preferred label: (personar etter sosiale, økonomiske og fysiske særtrekk eller eigenskapar) @nn
preferred label: (persons by social, economical or physical features or characteristics) @en

Lekfolk
type: Innholdsbeskrivende emne
type: Concept
created: 2023-01-25T00:00:00
modified: 2024-11-05T19:25:03
alternative label: Legmenn
alternative label: Lekmenn
alternative label: Lay persons @en
alternative label: Legfolk
broader: (personer etter sosiale, økonomiske og fysiske særtrekk eller egenskaper)
definition: I kristendommen er lekfolk ikke-geistlige personer, det vil si personer som ikke er prestevigde, også kalt verdslige personar. Begrepet lekfolk blir også brukt om personer som er ufaglærte innen et fagområde <SNL>
editorial note: Lukket bemerkning: ubo23
in scheme: Humord
preferred label: Lay people @en

Innholdsbeskrivende emne
type: Class
label: Topic @en