Humord
type: ConceptScheme

(personer etter sosiale, økonomiske og fysiske særtrekk eller egenskaper)
type: ThesaurusArray
type: Collection
narrower: Umyndige
preferred label: (personar etter sosiale, økonomiske og fysiske særtrekk eller eigenskapar) @nn
preferred label: (persons by social, economical or physical features or characteristics) @en

Umyndige
type: Concept
type: Innholdsbeskrivende emne
created: 2023-02-06T00:00:00
modified: 2024-11-04T08:38:38
alternative label: Incapacitated @en
alternative label: Umyndige personer
alternative label: Under age @en
alternative label: Umyndige personar @nn
broader: (personer etter sosiale, økonomiske og fysiske særtrekk eller egenskaper)
definition: Umyndige, fellesbetegnelse for dem som ikke er myndige, det vil si mindreårige (personer under 18 år) og voksne personer under vergemål (tidligere kalt umyndiggjorte) <SNL >
editorial note: Lukket bemerkning: ubo23
in scheme: Humord
preferred label: Minors @en

Innholdsbeskrivende emne
type: Class
label: Topic @en