Humord
type: ConceptScheme

(personer etter sosiale, økonomiske og fysiske særtrekk eller egenskaper)
type: ThesaurusArray
type: Collection
narrower: Debitorer
preferred label: (personar etter sosiale, økonomiske og fysiske særtrekk eller eigenskapar) @nn
preferred label: (persons by social, economical or physical features or characteristics) @en

Debitorer
type: Innholdsbeskrivende emne
type: Concept
created: 2023-03-09T00:00:00
modified: 2024-11-07T19:38:48
alternative label: Skyldnarar @nn
alternative label: Skyldnere
broader: (personer etter sosiale, økonomiske og fysiske særtrekk eller egenskaper)
definition: Debitor (også ofte kalt skyldner) er den som i et forpliktelsesforhold skylder noe. Det debitor skylder, vil ofte være penger, men kan også være en ting eller en tjeneste <SNL>
editorial note: Lukket bemerkning: ubo23
in scheme: Humord
preferred label: Debitorar @nn
preferred label: Debtors @en

Innholdsbeskrivende emne
type: Class
label: Topic @en