Humord
type: ConceptScheme

(dokumenter etter type)
type: ThesaurusArray
type: Collection
narrower: Faksimiler
preferred label: (dokument etter type) @nn
preferred label: (document by type) @en

Faksimiler
type: Innholdsbeskrivende emne
type: Concept
created: 2023-11-24T00:00:00
modified: 2023-11-24T14:06:16
alternative label: Faksimile
broader: (dokumenter etter type)
definition: Faksimile er en fotografisk fremstilt trykt reproduksjon (faksimileutgave) av et dokument, et manuskript, en bok og lignende <SNL>
editorial note: Lukket bemerkning: ubo23
in scheme: Humord
preferred label: Facsimiles @en
preferred label: Faksimilar @nn

Innholdsbeskrivende emne
type: Class
label: Topic @en