Humord
type: ConceptScheme

(teater etter form, funksjon, kontekst)
type: ThesaurusArray
type: Collection
narrower: Minstrel (Teater)
preferred label: (theatre by form, function, context) @en

Minstrel (Teater)
type: Innholdsbeskrivende emne
type: Concept
created: 2024-02-08T00:00:00
modified: 2024-02-08T12:10:30
alternative label: American minstrelsy @en
alternative label: Minstrelsy @en
broader: (teater etter form, funksjon, kontekst)
definition: Minstrel var en amerikansk varietéteaterform, som var populær fra begynnelsen av 1800-tallet til tidlig på 1900-tallet. Sjangeren bidro til å bygge og befeste stereotypier om afroamerikansk kultur og oppførsel, samtidig som den ga svarte musikere en mulighet til å livberge seg og nå et større, oftest hvitt publikum.<SNL>
editorial note: Lukket bemerkning: ubo24
in scheme: Humord
preferred label: Minstrel shows @en

Innholdsbeskrivende emne
type: Class
label: Topic @en