Humord
type: ConceptScheme

(sport etter type)
type: ThesaurusArray
type: Collection
narrower: Ekstremsport
preferred label: (sports by type) @en

Ekstremsport
type: Concept
type: Innholdsbeskrivende emne
ccmapper candidates: 1
ccmapper state: accepted
created: 2024-02-09T00:00:00
modified: 2024-02-09T15:06:06
alternative label: Adrenaline sport @en
broader: (sport etter type)
definition: Ekstremsport er idrett og fritidsaktivitet hvor utøveren tøyer fysiske grenser og/eller utsetter seg for relativt stor skaderisiko. <SNL>
editorial note: Lukket bemerkning: NIH
editorial note: Lukket bemerkning: ubo24
in scheme: Humord
mapping relation: e23
preferred label: Extreme sport @en

Innholdsbeskrivende emne
type: Class
label: Topic @en