Humord
type: ConceptScheme

(personer etter alder, kjønn og slektskap)
type: ThesaurusArray
type: Collection
narrower: Juniorer
preferred label: (personar etter alder, kjønn og slektskap) @nn
preferred label: (persons by age, sex and kinship) @en

Juniorer
type: Concept
type: Innholdsbeskrivende emne
ccmapper candidates: 1
ccmapper state: accepted
created: 2024-02-16T00:00:00
modified: 2025-09-09T09:51:05
broad match: e23
broader: (personer etter alder, kjønn og slektskap)
definition: Junior, betyr yngre og er ofte knyttet til en persons navn for å skjelne vedkommende fra en eldre person med samme navn, en senior. Junior forkortes jr. <SNL>
editorial note: Lukket bemerkning: ubo24
editorial note: Lukket bemerkning: NIH
in scheme: Humord
mapping relation: e23
preferred label: Juniorar @nn
preferred label: Juniors @en

Innholdsbeskrivende emne
type: Class
label: Topic @en