Humord
type: ConceptScheme

(dans etter type)
type: ThesaurusArray
type: Collection
narrower: Lambada
preferred label: (dance by type) @en

Lambada
type: Innholdsbeskrivende emne
type: Concept
created: 2024-02-20T00:00:00
modified: 2024-02-20T11:02:35
broader: (dans etter type)
definition: Lambada er en samba-inspirert dans som ble lansert i Europa i 1989/1990 av den multinasjonale gruppen Kaoma, sponset av en fransk leskedrikkprodusent. <SNL>
editorial note: Lukket bemerkning: ubo24
editorial note: Lukket bemerkning: NIH
in scheme: Humord

Innholdsbeskrivende emne
type: Class
label: Topic @en