Humord
type: ConceptScheme

(dans etter type)
type: ThesaurusArray
type: Collection
narrower: Moderne dans
preferred label: (dance by type) @en

Moderne dans
type: Concept
type: Innholdsbeskrivende emne
ccmapper candidates: 1
ccmapper state: accepted
created: 2024-02-20T00:00:00
modified: 2024-02-20T13:12:29
broader: (dans etter type)
definition: Moderne dans (contemporary) er et begrep som i dagens betydning stammer fra amerikansk dans og som betegner forskjellige teknikker og stiler innen scenisk dans som ikke er baserte på, og opprinnelig en reaksjon på klassisk dans – danse d’ecole. <wikipedia>
editorial note: Lukket bemerkning: NIH
editorial note: Lukket bemerkning: ubo24
in scheme: Humord
mapping relation: e23
preferred label: Modern dance @en

Innholdsbeskrivende emne
type: Class
label: Topic @en