Humord
type: ConceptScheme

(historie etter politiske hendelser)
type: ThesaurusArray
type: Collection
narrower: Flaggsaken
preferred label: (historie etter politiske hendingar @nn
preferred label: (history by political events) @en

Flaggsaken
type: Innholdsbeskrivende emne
type: Concept
ccmapper candidates: 1
ccmapper state: accepted
created: 2024-02-21T00:00:00
modified: 2025-06-05T12:37:45
alternative label: The flag issue regarding the union between Norway and Sweden @en
alternative label: Flaggstriden
broad match: e23
broader: (historie etter politiske hendelser)
definition: Flaggsaken var spørsmålet om hvorvidt Norges flagg i unionen med Sverige skulle fortsette å ha unionsmerke i øverste venstre hjørne. Saken var et av de unionelle spørsmålene som satte sinnene sterkest i bevegelse i slutten av 1870-årene. <SNL>
editorial note: Lukket bemerkning: norvok
editorial note: Lukket bemerkning: ubo24
in scheme: Humord
mapping relation: e23
preferred label: Flaggsaka @nn
preferred label: The flag dispute (Norwegian history) @en

Innholdsbeskrivende emne
type: Class
label: Topic @en