Humord
type: ConceptScheme

(planter etter type)
type: ThesaurusArray
type: Collection
narrower: Ugress
preferred label: (plantar etter type) @nn
preferred label: (plants by type) @en

Ugress
type: Innholdsbeskrivende emne
type: Concept
created: 2024-04-12T00:00:00
modified: 2025-12-10T12:55:26
alternative label: Ugressplanter
alternative label: Ugrasplantar @nn
alternative label: Ugrasplanter @nn
broader: (planter etter type)
definition: Ugress er uønskede planter, eller planter som gjør skade på en eller annen måte, og som man derfor ikke liker å ha stående der de er. <SNL>
editorial note: Lukket bemerkning: ubo24
in scheme: Humord
preferred label: Ugras @nn
preferred label: Weeds @en

Innholdsbeskrivende emne
type: Class
label: Topic @en