Humord
type: ConceptScheme

(dyr etter type)
type: ThesaurusArray
type: Collection
narrower: Nattdyr
preferred label: (animals by type) @en

Nattdyr
type: Concept
type: Innholdsbeskrivende emne
ccmapper candidates: 1
ccmapper state: accepted
created: 2024-04-25T00:00:00
modified: 2024-04-25T14:06:22
alternative label: Nattaktive dyr
alternative label: Nocturnality @en
broader: (dyr etter type)
definition: Nattdyr er innen zoologien dyr som mest er i virksomhet når det er mørkt. De kalles også nattaktive dyr. <SNL>
editorial note: Lukket bemerkning: ubo24
in scheme: Humord
mapping relation: e23
preferred label: Nocturnal animals @en

Innholdsbeskrivende emne
type: Class
label: Topic @en