Humord
type: ConceptScheme

(literature by type)
type: ThesaurusArray
type: Collection
narrower: Tilrettelagt litteratur
preferred label: (litteratur etter type)

Tilrettelagt litteratur
type: Innholdsbeskrivende emne
type: Concept
ccmapper candidates: 1
ccmapper state: accepted
created: 2024-06-07T00:00:00
modified: 2024-09-10T09:36:24
alternative label: Tilgjengeleg litteratur @nn
alternative label: Tilgjengelig litteratur
broad match: e23
broader: (literature by type)
definition: Tilrettelagt litteratur er litteratur utformet for å være tilgjengelig for personer med ulike former for utfordringer knyttet til lesing. <SNL>
editorial note: Lukket bemerkning: ubo24
editorial note: Lukket bemerkning: nbiemnfag
in scheme: Humord
mapping relation: e23
preferred label: Tilrettelagd litteratur @nn
preferred label: Accessible literature @en

Innholdsbeskrivende emne
type: Class
label: Topic @en