Humord
type: ConceptScheme

(planter etter type)
type: ThesaurusArray
type: Collection
narrower: Fiber plants
preferred label: (plantar etter type) @nn
preferred label: (plants by type) @en

Fiber plants
type: Concept
type: Innholdsbeskrivende emne
created: 2024-09-03T00:00:00
modified: 2025-08-15T12:38:54
alternative label: Fiberplantar @nn
alternative label: Fiber crops @en
broader: (planter etter type)
definition: Fiberplanter er planter som danner fibre, som er langstrakte, tykkveggede celler sammensatt av cellulosefibriller, ofte med innebygd lignin. <Wikipedia>
editorial note: Lukket bemerkning: ubo24
in scheme: Humord
preferred label: Fiberplanter

Innholdsbeskrivende emne
type: Class
label: Topic @en