Humord
type: ConceptScheme

(planter etter type)
type: ThesaurusArray
type: Collection
narrower: Villblomster
preferred label: (plantar etter type) @nn
preferred label: (plants by type) @en

Villblomster
type: Concept
type: Innholdsbeskrivende emne
created: 2024-12-09T00:00:00
modified: 2025-08-15T15:02:02
alternative label: Ville blomster
alternative label: Markblomar @nn
alternative label: Ville blomar @nn
alternative label: Markblomster
alternative label: Wildflowers @en
broader: (planter etter type)
definition: Markblomster eller villblomster er en fellesbetegnelse på blomster som ikke er plantet, men vokser fritt i naturen, til forskjell fra hageblomster. <Wikipedia>
editorial note: Lukket bemerkning: ubo24
in scheme: Humord
preferred label: Villblomar @nn
preferred label: Wild flowers @en

Innholdsbeskrivende emne
type: Class
label: Topic @en