Humord
type: ConceptScheme

(dokumenter etter type)
type: ThesaurusArray
type: Collection
narrower: Dekreter
preferred label: (dokument etter type) @nn
preferred label: (document by type) @en

Dekreter
type: Concept
type: Innholdsbeskrivende emne
created: 2025-01-02T00:00:00
modified: 2025-01-02T15:06:22
alternative label: Ordainments @en
preferred label: Dekret
broader: (dokumenter etter type)
definition: Dekret er en bestemmelse eller en beslutning, særlig om vedtak som blir gjort av et forvaltningsorgan. <SNL>
editorial note: Lukket bemerkning: ubo25
in scheme: Humord
preferred label: Decrees @en

Innholdsbeskrivende emne
type: Class
label: Topic @en