Humord
type: ConceptScheme

(movies by type)
type: ThesaurusArray
type: Collection
narrower: Sound films
preferred label: (film etter type) @nn

Sound films
type: Topic
type: Concept
created: 2025-03-04T00:00:00
modified: 2025-03-04T15:15:17
alternative label: Ljodfilmar @nn
alternative label: Lydfilm @nb
alternative label: Talkies
alternative label: Talking pictures
alternative label: Sound motion pictures
alternative label: Talking films
broader: (movies by type)
definition: Lydfilm er film hvor lyden er tatt opp og synkronisert med de levende bildene, til forskjell fra stumfilm hvor lyden (primært musikk) ble skapt av musikere ved hver enkelt visning og hvor tale ble gjengitt i form av mellomtekster. <SNL> @nb
editorial note: Lukket bemerkning: ubo25 @nb
in scheme: Humord
preferred label: Lydfilmar @nn
preferred label: Lydfilmer @nb

Topic
type: Class
label: Innholdsbeskrivende emne @nb