Humord
type: ConceptScheme

(planter etter type)
type: ThesaurusArray
type: Collection
narrower: Parasittiske planter
preferred label: (plantar etter type) @nn
preferred label: (plants by type) @en

Parasittiske planter
type: Innholdsbeskrivende emne
type: Concept
created: 2025-04-11T00:00:00
modified: 2025-08-15T13:33:42
alternative label: Parasitter (Plantar) @nn
alternative label: Parasitter (Planter)
alternative label: Parasittiske plantar @nn
broader: (planter etter type)
definition: Parasittiske planter kan deles i holoparasitter som mangler klorofyll og er helt avhengig av vertsplanten og hemiparasitter som har klorofyll, men er avhengig av vann og næringssalter fra vertsplanten. Hemiparasittene må ha konstant åpne spalteåpninger for å kunne trekke på vannet fra vertsplanten best mulig. <UiO>
editorial note: Lukket bemerkning: ubo25
in scheme: Humord
preferred label: Parasitic plants @en

Innholdsbeskrivende emne
type: Class
label: Topic @en