Humord
type: ConceptScheme

(personer etter sosiale, økonomiske og fysiske særtrekk eller egenskaper)
type: ThesaurusArray
type: Collection
narrower: Incels
preferred label: (personar etter sosiale, økonomiske og fysiske særtrekk eller eigenskapar) @nn
preferred label: (persons by social, economical or physical features or characteristics) @en

Incels
type: Innholdsbeskrivende emne
type: Concept
created: 2025-06-18T00:00:00
modified: 2025-06-18T15:01:02
alternative label: Incel
broader: (personer etter sosiale, økonomiske og fysiske særtrekk eller egenskaper)
definition: Incel identifiserer nokon, som oftast ein mann, som ikkje har hatt sex på lenge eller i det heile teke, og som opplever dette som sentralt for kven dei er. Omgrepet er ei samantrekking av det engelske involuntary celibate, det vil seie ufriviljug sølibat. <SNL>
editorial note: Lukket bemerkning: ubo25
in scheme: Humord

Innholdsbeskrivende emne
type: Class
label: Topic @en