Humord
type: ConceptScheme

(sport etter type)
type: ThesaurusArray
type: Collection
narrower: Strongman (Sport)
preferred label: (sports by type) @en

Strongman (Sport)
type: Concept
type: Innholdsbeskrivende emne
created: 2025-07-17T00:00:00
modified: 2025-07-17T12:11:24
broader: (sport etter type)
definition: Strongman er en konkurransesport som tester utøveres fysiske styrke og utholdenhet gjennom en rekke tunge løft og øvelser.<Wikipedia>
editorial note: Lukket bemerkning: ubo25
in scheme: Humord

Innholdsbeskrivende emne
type: Class
label: Topic @en