Humord
type: ConceptScheme

(personer etter sosiale, økonomiske og fysiske særtrekk eller egenskaper)
type: ThesaurusArray
type: Collection
narrower: Hipstere
preferred label: (personar etter sosiale, økonomiske og fysiske særtrekk eller eigenskapar) @nn
preferred label: (persons by social, economical or physical features or characteristics) @en

Hipstere
type: Innholdsbeskrivende emne
type: Concept
created: 2025-10-23T00:00:00
modified: 2025-10-23T11:25:22
broader: (personer etter sosiale, økonomiske og fysiske særtrekk eller egenskaper)
definition: Hipster er en ung og trendy person. Hipster er en uformell betegnelse på som regel unge mennesker som definerer tidsånden i sin sosiale klasse gjennom klær, yrke, verdier og holdninger. Hipstere er først ute med det som senere blir mote. <SNL>
editorial note: Lukket bemerkning: ubo25
in scheme: Humord
preferred label: Hipsters @en
preferred label: Hipsterar @nn

Innholdsbeskrivende emne
type: Class
label: Topic @en